Target
Transient receptor potential cation channel subfamily V member 1
Ligand
BDBM50331149
Substrate
Meas. Tech.
ChEMBL_686303 (CHEMBL1293059)
IC50
1450±n/a nM
Citation
 Hawryluk, NAMerit, JELebsack, ADBranstetter, BJHack, MDSwanson, NAo, HMaher, MPBhattacharya, AWang, QFreedman, JMScott, BPWickenden, ADChaplan, SRBreitenbucher, JG Discovery and synthesis of 6,7,8,9-tetrahydro-5H-pyrimido-[4,5-d]azepines as novel TRPV1 antagonists. Bioorg Med Chem Lett 20:7137-41 (2010)  
Target
Name:
Transient receptor potential cation channel subfamily V member 1
Synonyms:
Capsaicin receptor Osm-9-like TRP channel 1 TRPV1_HUMAN Transient receptor potential cation channel subfamily V member 1 (TRPV1) Transient receptor potential cation channel subfamily V member 1(TRPV1) Vanilloid VR1 Vanilloid receptor 1 Vanilloid receptor 1 (VRI/TRPV1)
Type:
Protein
Mol. Mass.:
94960.75
Organism:
Homo sapiens (Human)
Description:
Q8NER1
Residue:
839
  
Inhibitor
Name:
BDBM50331149
Synonyms:
CHEMBL1290254 | N-(3-(trifluoromethyl)phenyl)-7-(3-(trifluoromethyl)pyridin-2-yl)-5,6,7,8-tetrahydropyrido[3,4-d]pyrimidin-4-amine
Type:
Small organic molecule
Emp. Form.:
C20H15F6N5
Mol. Mass.:
439.357
SMILES:
FC(F)(F)c1cccc(Nc2ncnc3CN(CCc23)c2ncccc2C(F)(F)F)c1
: