Target
Transient receptor potential cation channel subfamily V member 1
Ligand
BDBM50331146
Substrate
Meas. Tech.
ChEMBL_686303 (CHEMBL1293059)
IC50
449±n/a nM
Citation
 Hawryluk, NAMerit, JELebsack, ADBranstetter, BJHack, MDSwanson, NAo, HMaher, MPBhattacharya, AWang, QFreedman, JMScott, BPWickenden, ADChaplan, SRBreitenbucher, JG Discovery and synthesis of 6,7,8,9-tetrahydro-5H-pyrimido-[4,5-d]azepines as novel TRPV1 antagonists. Bioorg Med Chem Lett 20:7137-41 (2010)  
Target
Name:
Transient receptor potential cation channel subfamily V member 1
Synonyms:
Capsaicin receptor Osm-9-like TRP channel 1 TRPV1_HUMAN Transient receptor potential cation channel subfamily V member 1 (TRPV1) Transient receptor potential cation channel subfamily V member 1(TRPV1) Vanilloid VR1 Vanilloid receptor 1 Vanilloid receptor 1 (VRI/TRPV1)
Type:
Protein
Mol. Mass.:
94960.75
Organism:
Homo sapiens (Human)
Description:
Q8NER1
Residue:
839
  
Inhibitor
Name:
BDBM50331146
Synonyms:
2-(2-(piperidin-1-yl)-4-(4-(trifluoromethyl)phenylamino)-8,9-dihydro-5H-pyrimido[5,4-d]azepin-7(6H)-yl)pyridine-3-sulfonamide US9422293, 298 | US9738649, Example 298
Type:
Small organic molecule
Emp. Form.:
C25H28F3N7O2S
Mol. Mass.:
547.596
SMILES:
NS(=O)(=O)c1cccnc1N1CCc2nc(nc(Nc3ccc(cc3)C(F)(F)F)c2CC1)N1CCCCC1
: