Target
Transient receptor potential cation channel subfamily V member 1
Ligand
BDBM50331147
Substrate
Meas. Tech.
ChEMBL_686303 (CHEMBL1293059)
IC50
462±n/a nM
Citation
 Hawryluk, NAMerit, JELebsack, ADBranstetter, BJHack, MDSwanson, NAo, HMaher, MPBhattacharya, AWang, QFreedman, JMScott, BPWickenden, ADChaplan, SRBreitenbucher, JG Discovery and synthesis of 6,7,8,9-tetrahydro-5H-pyrimido-[4,5-d]azepines as novel TRPV1 antagonists. Bioorg Med Chem Lett 20:7137-41 (2010)  
Target
Name:
Transient receptor potential cation channel subfamily V member 1
Synonyms:
Capsaicin receptor Osm-9-like TRP channel 1 TRPV1_HUMAN Transient receptor potential cation channel subfamily V member 1 (TRPV1) Transient receptor potential cation channel subfamily V member 1(TRPV1) Vanilloid VR1 Vanilloid receptor 1 Vanilloid receptor 1 (VRI/TRPV1)
Type:
Protein
Mol. Mass.:
94960.75
Organism:
Homo sapiens (Human)
Description:
Q8NER1
Residue:
839
  
Inhibitor
Name:
BDBM50331147
Synonyms:
5-chloro-6-(2-(piperidin-1-yl)-4-(4-(trifluoromethyl)phenylamino)-8,9-dihydro-5H-pyrimido[5,4-d]azepin-7(6H)-yl)nicotinic acid | CHEMBL1290480
Type:
Small organic molecule
Emp. Form.:
C26H26ClF3N6O2
Mol. Mass.:
546.972
SMILES:
OC(=O)c1cnc(N2CCc3nc(nc(Nc4ccc(cc4)C(F)(F)F)c3CC2)N2CCCCC2)c(Cl)c1
: