Target
Transient receptor potential cation channel subfamily V member 1
Ligand
BDBM50331136
Substrate
Meas. Tech.
ChEMBL_686303 (CHEMBL1293059)
IC50
2520±n/a nM
Citation
 Hawryluk, NAMerit, JELebsack, ADBranstetter, BJHack, MDSwanson, NAo, HMaher, MPBhattacharya, AWang, QFreedman, JMScott, BPWickenden, ADChaplan, SRBreitenbucher, JG Discovery and synthesis of 6,7,8,9-tetrahydro-5H-pyrimido-[4,5-d]azepines as novel TRPV1 antagonists. Bioorg Med Chem Lett 20:7137-41 (2010)  
Target
Name:
Transient receptor potential cation channel subfamily V member 1
Synonyms:
Capsaicin receptor Osm-9-like TRP channel 1 TRPV1_HUMAN Transient receptor potential cation channel subfamily V member 1 (TRPV1) Transient receptor potential cation channel subfamily V member 1(TRPV1) Vanilloid VR1 Vanilloid receptor 1 Vanilloid receptor 1 (VRI/TRPV1)
Type:
Protein
Mol. Mass.:
94960.75
Organism:
Homo sapiens (Human)
Description:
Q8NER1
Residue:
839
  
Inhibitor
Name:
BDBM50331136
Synonyms:
4-(2-isopropyl-7-(3-(trifluoromethyl)pyridin-2-yl)-6,7,8,9-tetrahydro-5H-pyrimido[5,4-d]azepin-4-ylamino)-N,N-dimethylbenzenesulfonamide US9422293, 154 | US9738649, Example 154
Type:
Small organic molecule
Emp. Form.:
C25H29F3N6O2S
Mol. Mass.:
534.597
SMILES:
CC(C)c1nc2CCN(CCc2c(Nc2ccc(cc2)S(=O)(=O)N(C)C)n1)c1ncccc1C(F)(F)F
: