Target
Transient receptor potential cation channel subfamily V member 1
Ligand
BDBM50331130
Substrate
Meas. Tech.
ChEMBL_686303 (CHEMBL1293059)
IC50
580±n/a nM
Citation
 Hawryluk, NAMerit, JELebsack, ADBranstetter, BJHack, MDSwanson, NAo, HMaher, MPBhattacharya, AWang, QFreedman, JMScott, BPWickenden, ADChaplan, SRBreitenbucher, JG Discovery and synthesis of 6,7,8,9-tetrahydro-5H-pyrimido-[4,5-d]azepines as novel TRPV1 antagonists. Bioorg Med Chem Lett 20:7137-41 (2010)  
Target
Name:
Transient receptor potential cation channel subfamily V member 1
Synonyms:
Capsaicin receptor Osm-9-like TRP channel 1 TRPV1_HUMAN Transient receptor potential cation channel subfamily V member 1 (TRPV1) Transient receptor potential cation channel subfamily V member 1(TRPV1) Vanilloid VR1 Vanilloid receptor 1 Vanilloid receptor 1 (VRI/TRPV1)
Type:
Protein
Mol. Mass.:
94960.75
Organism:
Homo sapiens (Human)
Description:
Q8NER1
Residue:
839
  
Inhibitor
Name:
BDBM50331130
Synonyms:
2-(6-((2-isopropyl-7-(3-(trifluoromethyl)pyridin-2-yl)-6,7,8,9-tetrahydro-5H-pyrimido[5,4-d]azepin-4-yl)methyl)pyridin-3-yl)-2-methylpropanenitrile | CHEMBL1289037
Type:
Small organic molecule
Emp. Form.:
C27H29F3N6
Mol. Mass.:
494.5546
SMILES:
CC(C)c1nc(Cc2ccc(cn2)C(C)(C)C#N)c2CCN(CCc2n1)c1ncccc1C(F)(F)F
: