Target
Transient receptor potential cation channel subfamily V member 1
Ligand
BDBM50331140
Substrate
Meas. Tech.
ChEMBL_686303 (CHEMBL1293059)
IC50
907±n/a nM
Citation
 Hawryluk, NAMerit, JELebsack, ADBranstetter, BJHack, MDSwanson, NAo, HMaher, MPBhattacharya, AWang, QFreedman, JMScott, BPWickenden, ADChaplan, SRBreitenbucher, JG Discovery and synthesis of 6,7,8,9-tetrahydro-5H-pyrimido-[4,5-d]azepines as novel TRPV1 antagonists. Bioorg Med Chem Lett 20:7137-41 (2010)  
Target
Name:
Transient receptor potential cation channel subfamily V member 1
Synonyms:
Capsaicin receptor Osm-9-like TRP channel 1 TRPV1_HUMAN Transient receptor potential cation channel subfamily V member 1 (TRPV1) Transient receptor potential cation channel subfamily V member 1(TRPV1) Vanilloid VR1 Vanilloid receptor 1 Vanilloid receptor 1 (VRI/TRPV1)
Type:
Protein
Mol. Mass.:
94960.75
Organism:
Homo sapiens (Human)
Description:
Q8NER1
Residue:
839
  
Inhibitor
Name:
BDBM50331140
Synonyms:
7-(3-chloropyridin-2-yl)-N-(4-(trifluoromethyl)phenyl)-6,7,8,9-tetrahydro-5H-pyrimido[5,4-d]azepin-4-amine US9422293, 30 | US9738649, Example 30
Type:
Small organic molecule
Emp. Form.:
C20H17ClF3N5
Mol. Mass.:
419.831
SMILES:
FC(F)(F)c1ccc(Nc2ncnc3CCN(CCc23)c2ncccc2Cl)cc1
: