Target
Transient receptor potential cation channel subfamily V member 1
Ligand
BDBM50331157
Substrate
Meas. Tech.
ChEMBL_686303 (CHEMBL1293059)
IC50
25±n/a nM
Citation
 Hawryluk, NAMerit, JELebsack, ADBranstetter, BJHack, MDSwanson, NAo, HMaher, MPBhattacharya, AWang, QFreedman, JMScott, BPWickenden, ADChaplan, SRBreitenbucher, JG Discovery and synthesis of 6,7,8,9-tetrahydro-5H-pyrimido-[4,5-d]azepines as novel TRPV1 antagonists. Bioorg Med Chem Lett 20:7137-41 (2010)  
Target
Name:
Transient receptor potential cation channel subfamily V member 1
Synonyms:
Capsaicin receptor Osm-9-like TRP channel 1 TRPV1_HUMAN Transient receptor potential cation channel subfamily V member 1 (TRPV1) Transient receptor potential cation channel subfamily V member 1(TRPV1) Vanilloid VR1 Vanilloid receptor 1 Vanilloid receptor 1 (VRI/TRPV1)
Type:
Protein
Mol. Mass.:
94960.75
Organism:
Homo sapiens (Human)
Description:
Q8NER1
Residue:
839
  
Inhibitor
Name:
BDBM50331157
Synonyms:
CHEMBL1290704 US9422293, 1 and 1A | US9738649, Example 1A
Type:
Small organic molecule
Emp. Form.:
C24H26F3N5
Mol. Mass.:
441.4919
SMILES:
CC(C)(C)c1ccc(Nc2ncnc3CCN(CCc23)c2ncccc2C(F)(F)F)cc1
: