Target
Adenosine receptor A2b
Ligand
BDBM50331914
Substrate
Meas. Tech.
ChEMBL_687325 (CHEMBL1292001)
Ki
4.5±n/a nM
Citation
 McGuinness, BFHo, KKStauffer, TMRokosz, LLMannava, NKultgen, SGSaionz, KKlon, AChen, WDesai, HRogers, WLWebb, MYin, JJiang, YLi, TYan, HJing, KZhang, SMajumdar, KKSrivastava, VSaha, S Discovery of novel quinolinone adenosine A2B antagonists. Bioorg Med Chem Lett 20:7414-20 (2010)  
Target
Name:
Adenosine receptor A2b
Synonyms:
AA2BR_HUMAN ADORA2B Adenosine receptors A2b | Adenosine receptors; A2a & A2b
Type:
G Protein-Coupled Receptor (GPCR)
Mol. Mass.:
36341.22
Organism:
Homo sapiens (Human)
Description:
Residue:
332
  
Inhibitor
Name:
BDBM50331914
Synonyms:
2-(2-oxo-4-phenethyl-3-(thiazol-2-yl)-1,2-dihydroquinolin-6-yloxy)-N-(1-phenylcyclopropyl)acetamide | CHEMBL1290001
Type:
Small organic molecule
Emp. Form.:
C31H27N3O3S
Mol. Mass.:
521.629
SMILES:
O=C(COc1ccc2[nH]c(=O)c(-c3nccs3)c(CCc3ccccc3)c2c1)NC1(CC1)c1ccccc1
: