Target
Adenosine receptor A2b
Ligand
BDBM50331913
Substrate
Meas. Tech.
ChEMBL_687329 (CHEMBL1292005)
Ki
1.3±n/a nM
Citation
 McGuinness, BFHo, KKStauffer, TMRokosz, LLMannava, NKultgen, SGSaionz, KKlon, AChen, WDesai, HRogers, WLWebb, MYin, JJiang, YLi, TYan, HJing, KZhang, SMajumdar, KKSrivastava, VSaha, S Discovery of novel quinolinone adenosine A2B antagonists. Bioorg Med Chem Lett 20:7414-20 (2010)  
Target
Name:
Adenosine receptor A2b
Synonyms:
AA2BR_HUMAN ADORA2B Adenosine receptors A2b | Adenosine receptors; A2a & A2b
Type:
G Protein-Coupled Receptor (GPCR)
Mol. Mass.:
36341.22
Organism:
Homo sapiens (Human)
Description:
Residue:
332
  
Inhibitor
Name:
BDBM50331913
Synonyms:
2-(2-oxo-4-phenethyl-3-(thiazol-2-yl)-1,2-dihydroquinolin-6-yloxy)-N-(2-phenylpropan-2-yl)acetamide | CHEMBL1290101
Type:
Small organic molecule
Emp. Form.:
C31H29N3O3S
Mol. Mass.:
523.645
SMILES:
CC(C)(NC(=O)COc1ccc2[nH]c(=O)c(-c3nccs3)c(CCc3ccccc3)c2c1)c1ccccc1
: