Target
Aromatase
Ligand
BDBM50332806
Substrate
Meas. Tech.
ChEMBL_696883 (CHEMBL1639399)
IC50
6500±n/a nM
Citation
 Dai, YWang, QZhang, XJia, SZheng, HFeng, DYu, P Molecular docking and QSAR study on steroidal compounds as aromatase inhibitors. Eur J Med Chem 45:5612-20 (2010)  
Target
Name:
Aromatase
Synonyms:
ARO1 CP19A_HUMAN CYP19 CYPXIX Cytochrome P450 19A1 Cytochrome P450-C19 (CYP19) FL cytokine receptor precursor | P-450AROM
Type:
Enzyme
Mol. Mass.:
57888.92
Organism:
Homo sapiens (Human)
Description:
P11511
Residue:
503
  
Inhibitor
Name:
BDBM50332806
Synonyms:
(3R,4S,5R,8R,9S,10R,13S,14S,17S)-10,13-Dimethyl-hexadecahydro-20-oxa-cyclopropa[3,4]cyclopenta[alpha]phenanth ren-17-ol | CHEMBL1629803
Type:
Small organic molecule
Emp. Form.:
C19H30O2
Mol. Mass.:
290.4403
SMILES:
C[C@]12CC[C@H]3[C@@H](CC[C@H]4[C@@H]5O[C@@H]5CC[C@]34C)[C@@H]1CC[C@@H]2O
: