Target
Aromatase
Ligand
BDBM50332815
Substrate
Meas. Tech.
ChEMBL_696883 (CHEMBL1639399)
IC50
3600±n/a nM
Citation
 Dai, YWang, QZhang, XJia, SZheng, HFeng, DYu, P Molecular docking and QSAR study on steroidal compounds as aromatase inhibitors. Eur J Med Chem 45:5612-20 (2010)  
Target
Name:
Aromatase
Synonyms:
ARO1 CP19A_HUMAN CYP19 CYPXIX Cytochrome P450 19A1 Cytochrome P450-C19 (CYP19) FL cytokine receptor precursor | P-450AROM
Type:
Enzyme
Mol. Mass.:
57888.92
Organism:
Homo sapiens (Human)
Description:
P11511
Residue:
503
  
Inhibitor
Name:
BDBM50332815
Synonyms:
(8R,9S,10S,13S,14S)-10-(hydroxymethyl)-13-methyl-17-oxo-2,3,6,7,8,9,10,11,12,13,14,15,16,17-tetradecahydro-1H-cyclopenta[alpha]phenanthren-4-yl acetate | CHEMBL1630265
Type:
Small organic molecule
Emp. Form.:
C21H30O4
Mol. Mass.:
346.4605
SMILES:
CC(=O)OC1=C2CC[C@H]3[C@@H]4CCC(=O)[C@@]4(C)CC[C@@H]3[C@@]2(CO)CCC1
: