Target
Aromatase
Ligand
BDBM50332826
Substrate
Meas. Tech.
ChEMBL_696883 (CHEMBL1639399)
IC50
1800±n/a nM
Citation
 Dai, YWang, QZhang, XJia, SZheng, HFeng, DYu, P Molecular docking and QSAR study on steroidal compounds as aromatase inhibitors. Eur J Med Chem 45:5612-20 (2010)  
Target
Name:
Aromatase
Synonyms:
ARO1 CP19A_HUMAN CYP19 CYPXIX Cytochrome P450 19A1 Cytochrome P450-C19 (CYP19) FL cytokine receptor precursor | P-450AROM
Type:
Enzyme
Mol. Mass.:
57888.92
Organism:
Homo sapiens (Human)
Description:
P11511
Residue:
503
  
Inhibitor
Name:
BDBM50332826
Synonyms:
(4S,8R,9S,10R,13S,14S)-4,10,13-trimethyl-3,4,7,8,9,10,11,12,13,14,15,16-dodecahydro-1H-cyclopenta[alpha]phenanthren-17(2H)-one | CHEMBL1630276
Type:
Small organic molecule
Emp. Form.:
C20H30O
Mol. Mass.:
286.4516
SMILES:
C[C@H]1CCC[C@]2(C)[C@H]3CC[C@@]4(C)[C@@H](CCC4=O)[C@@H]3CC=C12
: