Target
Aromatase
Ligand
BDBM50332832
Substrate
Meas. Tech.
ChEMBL_696883 (CHEMBL1639399)
IC50
660±n/a nM
Citation
 Dai, YWang, QZhang, XJia, SZheng, HFeng, DYu, P Molecular docking and QSAR study on steroidal compounds as aromatase inhibitors. Eur J Med Chem 45:5612-20 (2010)  
Target
Name:
Aromatase
Synonyms:
ARO1 CP19A_HUMAN CYP19 CYPXIX Cytochrome P450 19A1 Cytochrome P450-C19 (CYP19) FL cytokine receptor precursor | P-450AROM
Type:
Enzyme
Mol. Mass.:
57888.92
Organism:
Homo sapiens (Human)
Description:
P11511
Residue:
503
  
Inhibitor
Name:
BDBM50332832
Synonyms:
(8R,9S,10S,13S,14S)-10,13-dimethyl-3,4,7,8,9,10,11,12,13,14,15,16-dodecahydro-1H-cyclopenta[a]phenanthren-17(2H)-one | CHEMBL1630910
Type:
Small organic molecule
Emp. Form.:
C19H28O
Mol. Mass.:
272.425
SMILES:
C[C@]12CC[C@H]3[C@@H](CC=C4CCCC[C@@]34C)[C@@H]1CCC2=O
: