Target
DNA polymerase subunit gamma-1
Ligand
BDBM50333129
Substrate
Meas. Tech.
ChEMBL_695611 (CHEMBL1639859)
IC50
>1000000±n/a nM
Citation
 Lam, AMMurakami, EEspiritu, CSteuer, HMNiu, CKeilman, MBao, HZennou, VBourne, NJulander, JGMorrey, JDSmee, DFFrick, DNHeck, JAWang, PNagarathnam, DRoss, BSSofia, MJOtto, MJFurman, PA PSI-7851, a pronucleotide of beta-D-2'-deoxy-2'-fluoro-2'-C-methyluridine monophosphate, is a potent and pan-genotype inhibitor of hepatitis C virus replication. Antimicrob Agents Chemother 54:3187-96 (2010)  
Target
Name:
DNA polymerase subunit gamma-1
Synonyms:
DNA Polymerase gamma DNA polymerase (alpha/delta/epsilon) DNA polymerase delta subunit 1 DNA polymerase gamma subunit 1 DNA polymerase kappa DNA polymerase subunit gamma-1 DPOG1_HUMAN Mitochondrial DNA polymerase catalytic subunit POLG1 PolG-alpha
Type:
Enzyme Subunit
Mol. Mass.:
139566.98
Organism:
Homo sapiens (Human)
Description:
Enzyme was purchased from Ulrich Hubscher, University of Zurich-Irchel, Switzerland.
Residue:
1239
  
Inhibitor
Name:
BDBM50333129
Synonyms:
((2R,3R,4R,5R)-5-(2,4-dioxo-3,4-dihydropyrimidin-1(2H)-yl)-4-fluoro-3-hydroxy-4-methyltetrahydrofuran-2-yl)methyl tetrahydrogen triphosphate CHEMBL486231 | beta-D-2'-deoxy-2'-fluoro-2'-C-methyluridine triphosphate
Type:
Small organic molecule
Emp. Form.:
C10H16FN2O14P3
Mol. Mass.:
500.1587
SMILES:
C[C@@]1(F)[C@H](O)[C@@H](COP(O)(=O)OP(O)(=O)OP(O)(O)=O)O[C@H]1n1ccc(=O)[nH]c1=O
: