Target
Sodium- and chloride-dependent GABA transporter 1
Ligand
BDBM50417637
Substrate
Meas. Tech.
ChEMBL_699418 (CHEMBL1647445)
Ki
41.69±n/a nM
Citation
 Pizzi, DALeslie, CPDi Fabio, RSeri, CBernasconi, GSquaglia, MCarnevale, GFalchi, AGreco, EMangiarini, LNegri, M Stereospecific synthesis and structure-activity relationships of unsymmetrical 4,4-diphenylbut-3-enyl derivatives of nipecotic acid as GAT-1 inhibitors. Bioorg Med Chem Lett 21:602-5 (2010)  
Target
Name:
Sodium- and chloride-dependent GABA transporter 1
Synonyms:
GABA transporter 1 GABT1 GAT1 SLC6A1 Solute carrier family 6 member 1
Type:
PROTEIN
Mol. Mass.:
67079.40
Organism:
Homo sapiens (Human)
Description:
ChEMBL_1454196
Residue:
599
  
Inhibitor
Name:
BDBM50417637
Synonyms:
CHEMBL1642394
Type:
Small organic molecule
Emp. Form.:
C24H29NO2
Mol. Mass.:
363.4926
SMILES:
[#6]-c1ccccc1\[#6](=[#6]/[#6]-[#6]-[#7]-1-[#6]-[#6]-[#6]-[#6@H](-[#6]-1)-[#6](-[#8])=O)-c1ccccc1-[#6]
: