Target
Sodium- and chloride-dependent GABA transporter 1
Ligand
BDBM50417643
Substrate
Meas. Tech.
ChEMBL_699418 (CHEMBL1647445)
Ki
831.76±n/a nM
Citation
 Pizzi, DALeslie, CPDi Fabio, RSeri, CBernasconi, GSquaglia, MCarnevale, GFalchi, AGreco, EMangiarini, LNegri, M Stereospecific synthesis and structure-activity relationships of unsymmetrical 4,4-diphenylbut-3-enyl derivatives of nipecotic acid as GAT-1 inhibitors. Bioorg Med Chem Lett 21:602-5 (2010)  
Target
Name:
Sodium- and chloride-dependent GABA transporter 1
Synonyms:
GABA transporter 1 GABT1 GAT1 SLC6A1 Solute carrier family 6 member 1
Type:
PROTEIN
Mol. Mass.:
67079.40
Organism:
Homo sapiens (Human)
Description:
ChEMBL_1454196
Residue:
599
  
Inhibitor
Name:
BDBM50417643
Synonyms:
CHEMBL1642403
Type:
Small organic molecule
Emp. Form.:
C22H24FNO2
Mol. Mass.:
353.4299
SMILES:
[#8]-[#6](=O)C1(F)[#6]-[#6]-[#6]-[#7](-[#6]-[#6]\[#6]=[#6](/c2ccccc2)-c2ccccc2)-[#6]1
: