Target
Sodium- and chloride-dependent GABA transporter 1
Ligand
BDBM50334247
Substrate
Meas. Tech.
ChEMBL_699418 (CHEMBL1647445)
Ki
14.79±n/a nM
Citation
 Pizzi, DALeslie, CPDi Fabio, RSeri, CBernasconi, GSquaglia, MCarnevale, GFalchi, AGreco, EMangiarini, LNegri, M Stereospecific synthesis and structure-activity relationships of unsymmetrical 4,4-diphenylbut-3-enyl derivatives of nipecotic acid as GAT-1 inhibitors. Bioorg Med Chem Lett 21:602-5 (2010)  
Target
Name:
Sodium- and chloride-dependent GABA transporter 1
Synonyms:
GABA transporter 1 GABT1 GAT1 SLC6A1 Solute carrier family 6 member 1
Type:
PROTEIN
Mol. Mass.:
67079.40
Organism:
Homo sapiens (Human)
Description:
ChEMBL_1454196
Residue:
599
  
Inhibitor
Name:
BDBM50334247
Synonyms:
(R,E)-1-(4-(2-fluorophenyl)-4-o-tolylbut-3-enyl)piperidine-3-carboxylic acid | CHEMBL1641613
Type:
Small organic molecule
Emp. Form.:
C23H26FNO2
Mol. Mass.:
367.4564
SMILES:
Cc1ccccc1\C(=C/CCN1CCC[C@H](C1)C(O)=O)c1ccccc1F
: