Target
Cytochrome P450 2D6
Ligand
BDBM50334249
Substrate
Meas. Tech.
ChEMBL_699594 (CHEMBL1647952)
IC50
26400±n/a nM
Citation
 Nirogi, RVDeshpande, ADKambhampati, RBadange, RKKota, LDaulatabad, AVShinde, AKAhmad, IKandikere, VJayarajan, PDubey, PK Indole-3-piperazinyl derivatives: novel chemical class of 5-HT(6) receptor antagonists. Bioorg Med Chem Lett 21:346-9 (2010)  
Target
Name:
Cytochrome P450 2D6
Synonyms:
CP2D6_HUMAN CYP2DL1 Cytochrome P450 2D6 (CYP2D6) P450-DB1
Type:
Protein
Mol. Mass.:
55774.82
Organism:
Homo sapiens (Human)
Description:
P10635
Residue:
497
  
Inhibitor
Name:
BDBM50334249
Synonyms:
1-(4-Fluorobenzenesulfonyl)-3-(4-methylpiperazin-1-yl)-1H-indole | CHEMBL1642413
Type:
Small organic molecule
Emp. Form.:
C19H20FN3O2S
Mol. Mass.:
373.444
SMILES:
CN1CCN(CC1)c1cn(c2ccccc12)S(=O)(=O)c1ccc(F)cc1
: