Target
Transcription factor p65
Ligand
BDBM50335579
Substrate
Meas. Tech.
ChEMBL_714888 (CHEMBL1663834)
IC50
>20000±n/a nM
Citation
 Pan, LKardono, LBRiswan, SChai, HCarcache de Blanco, EJPannell, CMSoejarto, DDMcCloud, TGNewman, DJKinghorn, AD Isolation and characterization of minor analogues of silvestrol and other constituents from a large-scale re-collection of Aglaia foveolata. J Nat Prod 73:1873-8 (2010)  
Target
Name:
Transcription factor p65
Synonyms:
NFKB3 Nuclear factor NF-kappa-B p65 subunit TF65_HUMAN | v-rel reticuloendotheliosis viral oncogene homolog A isoform 1
Type:
Enzyme
Mol. Mass.:
60211.92
Organism:
Homo sapiens (Human)
Description:
Q04206
Residue:
551
  
Inhibitor
Name:
BDBM50335579
Synonyms:
17,24-Epoxy-20alpha,25-dihydroxy-21-norbaccharan-3-one | CHEMBL1651032
Type:
Small organic molecule
Emp. Form.:
C29H48O4
Mol. Mass.:
460.689
SMILES:
CC(C)(O)[C@@H]1CC[C@@]2(O)CC[C@]3(C)[C@H](CC[C@@H]4[C@@]5(C)CCC(=O)C(C)(C)[C@H]5CC[C@@]34C)[C@H]2O1
: