Target
Transcription factor p65
Ligand
BDBM50335581
Substrate
Meas. Tech.
ChEMBL_714888 (CHEMBL1663834)
IC50
>20000±n/a nM
Citation
 Pan, LKardono, LBRiswan, SChai, HCarcache de Blanco, EJPannell, CMSoejarto, DDMcCloud, TGNewman, DJKinghorn, AD Isolation and characterization of minor analogues of silvestrol and other constituents from a large-scale re-collection of Aglaia foveolata. J Nat Prod 73:1873-8 (2010)  
Target
Name:
Transcription factor p65
Synonyms:
NFKB3 Nuclear factor NF-kappa-B p65 subunit TF65_HUMAN | v-rel reticuloendotheliosis viral oncogene homolog A isoform 1
Type:
Enzyme
Mol. Mass.:
60211.92
Organism:
Homo sapiens (Human)
Description:
Q04206
Residue:
551
  
Inhibitor
Name:
BDBM50335581
Synonyms:
20S,24S-Epoxy-25-hydroxy-A-homo-4-oxadammaran-3-one | CHEMBL1651034
Type:
Small organic molecule
Emp. Form.:
C30H50O4
Mol. Mass.:
474.7156
SMILES:
CC(C)(O)[C@@H]1CC[C@](C)(O1)[C@H]1CC[C@]2(C)[C@@H]1CC[C@@H]1[C@@]3(C)CCC(=O)OC(C)(C)[C@@H]3CC[C@@]21C
: