Target
Transcription factor p65
Ligand
BDBM50335583
Substrate
Meas. Tech.
ChEMBL_714888 (CHEMBL1663834)
IC50
>20000±n/a nM
Citation
 Pan, LKardono, LBRiswan, SChai, HCarcache de Blanco, EJPannell, CMSoejarto, DDMcCloud, TGNewman, DJKinghorn, AD Isolation and characterization of minor analogues of silvestrol and other constituents from a large-scale re-collection of Aglaia foveolata. J Nat Prod 73:1873-8 (2010)  
Target
Name:
Transcription factor p65
Synonyms:
NFKB3 Nuclear factor NF-kappa-B p65 subunit TF65_HUMAN | v-rel reticuloendotheliosis viral oncogene homolog A isoform 1
Type:
Enzyme
Mol. Mass.:
60211.92
Organism:
Homo sapiens (Human)
Description:
Q04206
Residue:
551
  
Inhibitor
Name:
BDBM50335583
Synonyms:
CHEMBL555196 | silvestrol
Type:
Small organic molecule
Emp. Form.:
C34H38O13
Mol. Mass.:
654.6577
SMILES:
CO[C@@H]1OC[C@@H](O[C@H]1Oc1cc2O[C@]3([C@@H]([C@H]([C@@H](O)[C@@]3(O)c2c(OC)c1)C(=O)OC)c1ccccc1)c1ccc(OC)cc1)[C@H](O)CO
: