Target
Cholinesterase
Ligand
BDBM50336116
Substrate
Meas. Tech.
ChEMBL_718129 (CHEMBL1671582)
IC50
6820±n/a nM
Citation
 Musilek, KKomloova, MHolas, OHrabinova, MPohanka, MDohnal, VNachon, FDolezal, MKuca, K Preparation and in vitro screening of symmetrical bis-isoquinolinium cholinesterase inhibitors bearing various connecting linkage--implications for early Myasthenia gravis treatment. Eur J Med Chem 46:811-8 (2011)  
Target
Name:
Cholinesterase
Synonyms:
Acylcholine acylhydrolase Butyrylcholine esterase (BChE) Butyrylcholinesterase (BuChE) CHLE_HUMAN Cholinesterases Pseudocholinesterase
Type:
Homotetramer
Mol. Mass.:
68422.27
Organism:
Homo sapiens (Human)
Description:
P06276
Residue:
602
  
Inhibitor
Name:
BDBM50336116
Synonyms:
Ambenonium dichloride | CHEMBL1669479
Type:
Small organic molecule
Emp. Form.:
C24H34Cl2N4O2
Mol. Mass.:
481.457
SMILES:
C[N+](C)(CCNC(=O)C(=O)NCC[N+](C)(C)Cc1ccccc1Cl)Cc1ccccc1Cl
: