Target
DNA polymerase subunit gamma-1
Ligand
BDBM50336502
Substrate
Meas. Tech.
ChEMBL_720298 (CHEMBL1679164)
IC50
>100000±n/a nM
Citation
 Nyanguile, OPauwels, FVan den Broeck, WBoutton, CWQuirynen, LIvens, Tvan der Helm, LVandercruyssen, GMostmans, WDelouvroy, FDehertogh, PCummings, MDBonfanti, JFSimmen, KARaboisson, P 1,5-benzodiazepines, a novel class of hepatitis C virus polymerase nonnucleoside inhibitors. Antimicrob Agents Chemother 52:4420-31 (2008)  
Target
Name:
DNA polymerase subunit gamma-1
Synonyms:
DNA Polymerase gamma DNA polymerase (alpha/delta/epsilon) DNA polymerase delta subunit 1 DNA polymerase gamma subunit 1 DNA polymerase kappa DNA polymerase subunit gamma-1 DPOG1_HUMAN Mitochondrial DNA polymerase catalytic subunit POLG1 PolG-alpha
Type:
Enzyme Subunit
Mol. Mass.:
139566.98
Organism:
Homo sapiens (Human)
Description:
Enzyme was purchased from Ulrich Hubscher, University of Zurich-Irchel, Switzerland.
Residue:
1239
  
Inhibitor
Name:
BDBM50336502
Synonyms:
10-acetyl-11-(2,4-dichlorophenyl)-3,3-dimethyl-2,3,4,5,10,11-hexahydro-1H-dibenzo[b,e][1,4]diazepin-1-one | CHEMBL467903
Type:
Small organic molecule
Emp. Form.:
C23H22Cl2N2O2
Mol. Mass.:
429.339
SMILES:
CC(=O)N1C(C2C(=O)CC(C)(C)CC2=Nc2ccccc12)c1ccc(Cl)cc1Cl
: