Target
Muscarinic acetylcholine receptor M3
Ligand
BDBM50005677
Substrate
Meas. Tech.
ChEMBL_723353 (CHEMBL1673550)
EC50
1800±n/a nM
Citation
 Ziegler, NBätz, JZabel, ULohse, MJHoffmann, C FRET-based sensors for the human M1-, M3-, and M5-acetylcholine receptors. Bioorg Med Chem 19:1048-54 (2011)  
Target
Name:
Muscarinic acetylcholine receptor M3
Synonyms:
ACM3_HUMAN Cholinergic, muscarinic M3 Muscarinic receptor M3 | RecName: Full=Muscarinic acetylcholine receptor M3
Type:
Enzyme
Mol. Mass.:
66151.03
Organism:
Homo sapiens (Human)
Description:
P20309
Residue:
590
  
Inhibitor
Name:
BDBM50005677
Synonyms:
CHEMBL23957 Trimethyl-[4-(2-oxo-pyrrolidin-1-yl)-but-2-ynyl]-ammonium; iodide
Type:
Small organic molecule
Emp. Form.:
C11H19N2O
Mol. Mass.:
195.2808
SMILES:
C[N+](C)(C)CC#CCN1CCCC1=O
: