Target
Muscarinic acetylcholine receptor M5
Ligand
BDBM50005677
Substrate
Meas. Tech.
ChEMBL_723354 (CHEMBL1673551)
EC50
2300±n/a nM
Citation
 Ziegler, NBätz, JZabel, ULohse, MJHoffmann, C FRET-based sensors for the human M1-, M3-, and M5-acetylcholine receptors. Bioorg Med Chem 19:1048-54 (2011)  
Target
Name:
Muscarinic acetylcholine receptor M5
Synonyms:
ACM5_HUMAN | CHRM5
Type:
PROTEIN
Mol. Mass.:
60102.35
Organism:
Homo sapiens (Human)
Description:
ChEMBL_1517990
Residue:
532
  
Inhibitor
Name:
BDBM50005677
Synonyms:
CHEMBL23957 Trimethyl-[4-(2-oxo-pyrrolidin-1-yl)-but-2-ynyl]-ammonium; iodide
Type:
Small organic molecule
Emp. Form.:
C11H19N2O
Mol. Mass.:
195.2808
SMILES:
C[N+](C)(C)CC#CCN1CCCC1=O
: