Target
Muscarinic acetylcholine receptor M5
Ligand
BDBM50336544
Substrate
Meas. Tech.
ChEMBL_723354 (CHEMBL1673551)
EC50
1300±n/a nM
Citation
 Ziegler, NBätz, JZabel, ULohse, MJHoffmann, C FRET-based sensors for the human M1-, M3-, and M5-acetylcholine receptors. Bioorg Med Chem 19:1048-54 (2011)  
Target
Name:
Muscarinic acetylcholine receptor M5
Synonyms:
ACM5_HUMAN | CHRM5
Type:
PROTEIN
Mol. Mass.:
60102.35
Organism:
Homo sapiens (Human)
Description:
ChEMBL_1517990
Residue:
532
  
Inhibitor
Name:
BDBM50336544
Synonyms:
(+)-Muscarine chloride muscarine chloride
Type:
Small organic molecule
Emp. Form.:
C9H20NO2
Mol. Mass.:
174.2601
SMILES:
C[C@@H]1O[C@H](C[N+](C)(C)C)C[C@H]1O
: