Target
Cannabinoid receptor 2
Ligand
BDBM50340315
Substrate
Meas. Tech.
ChEMBL_741484 (CHEMBL1763799)
IC50
3±n/a nM
Citation
 Trotter, BWNanda, KKBurgey, CSPotteiger, CMDeng, JZGreen, AIHartnett, JCKett, NRWu, ZHenze, DADella Penna, KDesai, RLeitl, MDLemaire, WWhite, RBYeh, SUrban, MOKane, SAHartman, GDBilodeau, MT Imidazopyridine CB2 agonists: optimization of CB2/CB1 selectivity and implications for in vivo analgesic efficacy. Bioorg Med Chem Lett 21:2354-8 (2011)  
Target
Name:
Cannabinoid receptor 2
Synonyms:
CANNABINOID CB2 CB2 CB2B CNR2_HUMAN Cannabinoid CB2 receptor Cannabinoid receptor 2 (CB2R) | hCB2
Type:
G Protein-Coupled Receptor (GPCR)
Mol. Mass.:
39690.94
Organism:
Homo sapiens (Human)
Description:
P34972
Residue:
360
  
Inhibitor
Name:
BDBM50340315
Synonyms:
3-((4,4-difluoropiperidin-1-yl)methyl)-N-((1-(hydroxymethyl)cyclopentyl)methyl)imidazo[1,5-a]pyridine-1-carboxamide | CHEMBL1760935
Type:
Small organic molecule
Emp. Form.:
C21H28F2N4O2
Mol. Mass.:
406.4694
SMILES:
OCC1(CNC(=O)c2nc(CN3CCC(F)(F)CC3)n3ccccc23)CCCC1
: