Target
Cytochrome P450 11B2, mitochondrial
Ligand
BDBM50341474
Substrate
Meas. Tech.
ChEMBL_742192 (CHEMBL1768362)
IC50
0.7±n/a nM
Citation
 Lucas, SNegri, MHeim, RZimmer, CHartmann, RW Fine-tuning the selectivity of aldosterone synthase inhibitors: structure-activity and structure-selectivity insights from studies of heteroaryl substituted 1,2,5,6-tetrahydropyrrolo[3,2,1-ij]quinolin-4-one derivatives. J Med Chem 54:2307-19 (2011)  
Target
Name:
Cytochrome P450 11B2, mitochondrial
Synonyms:
Aldosterone Synthase (CYP11B2) Aldosterone-synthesizing enzyme CYP11B2 Cytochrome P450 11B2 Cytochrome P450 11B2, mitochondrial P-450C18 | Steroid 18-hydroxylase
Type:
Protein
Mol. Mass.:
57582.15
Organism:
Homo sapiens (Human)
Description:
P19099
Residue:
503
  
Inhibitor
Name:
BDBM50341474
Synonyms:
8-[5-(2-Fluorophenyl)pyridin-3-yl]-1,2,5,6-tetrahydro-4H-pyrrolo[3,2,1-ij]quinolin-4-one | CHEMBL1765220
Type:
Small organic molecule
Emp. Form.:
C22H17FN2O
Mol. Mass.:
344.3816
SMILES:
Fc1ccccc1-c1cncc(c1)-c1cc2CCN3c2c(CCC3=O)c1
: