Target
D(1A) dopamine receptor
Ligand
BDBM50341510
Substrate
Meas. Tech.
ChEMBL_742111 (CHEMBL1769066)
Ki
23000±n/a nM
Citation
 Tschammer, NElsner, JGoetz, AEhrlich, KSchuster, SRuberg, MKühhorn, JThompson, DWhistler, JHübner, HGmeiner, P Highly potent 5-aminotetrahydropyrazolopyridines: enantioselective dopamine D3 receptor binding, functional selectivity, and analysis of receptor-ligand interactions. J Med Chem 54:2477-91 (2011)  
Target
Name:
D(1A) dopamine receptor
Synonyms:
DRD1 Dopamine D1 receptor
Type:
PROTEIN
Mol. Mass.:
49269.92
Organism:
Sus scrofa
Description:
ChEMBL_1460140
Residue:
446
  
Inhibitor
Name:
BDBM50341510
Synonyms:
CHEMBL1765631 | N-(4-(4-Phenylbenzoylamino)butyl)-N-propyl-5-amino-4,5,6,7-tetrahydropyrazolo[1,5-a]pyridine-3-carbaldehyde
Type:
Small organic molecule
Emp. Form.:
C28H34N4O2
Mol. Mass.:
458.5952
SMILES:
CCCN(CCCCNC(=O)c1ccc(cc1)-c1ccccc1)C1CCn2ncc(C=O)c2C1
: