Target
Nuclear receptor subfamily 5 group A member 2
Ligand
BDBM50418301
Substrate
Meas. Tech.
ChEMBL_743679 (CHEMBL1767448)
EC50
3162.28±n/a nM
Citation
 Whitby, RJStec, JBlind, RDDixon, SLeesnitzer, LMOrband-Miller, LAWilliams, SPWillson, TMXu, RZuercher, WJCai, FIngraham, HA Small molecule agonists of the orphan nuclear receptors steroidogenic factor-1 (SF-1, NR5A1) and liver receptor homologue-1 (LRH-1, NR5A2). J Med Chem 54:2266-81 (2011)  
Target
Name:
Nuclear receptor subfamily 5 group A member 2
Synonyms:
Alpha-1-fetoprotein transcription factor B1F CYP7A promoter-binding factor Hepatocytic transcription factor Liver Receptor Homolog 1 NR5A2_HUMAN hB1F | nuclear receptor subfamily 5 group A member 2 isoform 2
Type:
Nuclear Hormone Receptor
Mol. Mass.:
61341.37
Organism:
Homo sapiens (Human)
Description:
Residue:
541
  
Inhibitor
Name:
BDBM50418301
Synonyms:
CHEMBL1765928
Type:
Small organic molecule
Emp. Form.:
C23H34O
Mol. Mass.:
326.5155
SMILES:
CCCCCCC1=C(c2ccccc2)[C@@]2(CCC[C@@H]2C1)OC(C)C
: