Target
Steroidogenic factor 1
Ligand
BDBM50418324
Substrate
Meas. Tech.
ChEMBL_743680 (CHEMBL1767449)
EC50
316.23±n/a nM
Citation
 Whitby, RJStec, JBlind, RDDixon, SLeesnitzer, LMOrband-Miller, LAWilliams, SPWillson, TMXu, RZuercher, WJCai, FIngraham, HA Small molecule agonists of the orphan nuclear receptors steroidogenic factor-1 (SF-1, NR5A1) and liver receptor homologue-1 (LRH-1, NR5A2). J Med Chem 54:2266-81 (2011)  
Target
Name:
Steroidogenic factor 1
Synonyms:
AD4BP FTZF1 NR5A1 SF-1 STF-1 Steroid hormone receptor Ad4BP
Type:
Nuclear Hormone Receptor
Mol. Mass.:
51643.43
Organism:
Homo sapiens (Human)
Description:
Residue:
461
  
Inhibitor
Name:
BDBM50418324
Synonyms:
CHEMBL1765957
Type:
Small organic molecule
Emp. Form.:
C28H35N
Mol. Mass.:
385.5842
SMILES:
CCCCCCC1=C(c2ccccc2)[C@@]2(CN(C)C[C@@H]2C1)C(=C)c1ccccc1
: