Target
Diacylglycerol O-acyltransferase 1
Ligand
BDBM50341780
Substrate
Meas. Tech.
ChEMBL_743545 (CHEMBL1767986)
EC50
2363±n/a nM
Citation
 Qian, YWertheimer, SJAhmad, MCheung, AWFirooznia, FHamilton, MMHayden, SLi, SMarcopulos, NMcDermott, LTan, JYun, WGuo, LPamidimukkala, AChen, YHuang, KSRamsey, GBWhittard, TConde-Knape, KTaub, RRondinone, CMTilley, JBolin, D Discovery of orally active carboxylic acid derivatives of 2-phenyl-5-trifluoromethyloxazole-4-carboxamide as potent diacylglycerol acyltransferase-1 inhibitors for the potential treatment of obesity and diabetes. J Med Chem 54:2433-46 (2011)  
Target
Name:
Diacylglycerol O-acyltransferase 1
Synonyms:
ACAT-related gene product 1 Acyl coA-diacylglycerol acyl transferase 1 (DGAT1) DGAT1 Diacylglycerol Acyltransferase (DGAT1) Diacylglycerol O-acyltransferase 1 (DGAT1) | Diglyceride acyltransferase
Type:
Protein
Mol. Mass.:
55297.82
Organism:
Homo sapiens (Human)
Description:
O75907
Residue:
488
  
Inhibitor
Name:
BDBM50341780
Synonyms:
4-{5-[(2-Phenyl-5-trifluoromethyloxazole-4-carbonyl)amino]-3',4',5',6'-tetrahydro-2'H-[2,4']bipyridinyl-1'-carbonyl}-transcyclohexanecarboxylic Acid | CHEMBL1766808
Type:
Small organic molecule
Emp. Form.:
C29H29F3N4O5
Mol. Mass.:
570.5596
SMILES:
OC(=O)[C@H]1CC[C@@H](CC1)C(=O)N1CCC(CC1)c1ccc(NC(=O)c2nc(oc2C(F)(F)F)-c2ccccc2)cn1
: