Target
Diacylglycerol O-acyltransferase 1
Ligand
BDBM27947
Substrate
Meas. Tech.
ChEMBL_743545 (CHEMBL1767986)
EC50
1436±n/a nM
Citation
 Qian, YWertheimer, SJAhmad, MCheung, AWFirooznia, FHamilton, MMHayden, SLi, SMarcopulos, NMcDermott, LTan, JYun, WGuo, LPamidimukkala, AChen, YHuang, KSRamsey, GBWhittard, TConde-Knape, KTaub, RRondinone, CMTilley, JBolin, D Discovery of orally active carboxylic acid derivatives of 2-phenyl-5-trifluoromethyloxazole-4-carboxamide as potent diacylglycerol acyltransferase-1 inhibitors for the potential treatment of obesity and diabetes. J Med Chem 54:2433-46 (2011)  
Target
Name:
Diacylglycerol O-acyltransferase 1
Synonyms:
ACAT-related gene product 1 Acyl coA-diacylglycerol acyl transferase 1 (DGAT1) DGAT1 Diacylglycerol Acyltransferase (DGAT1) Diacylglycerol O-acyltransferase 1 (DGAT1) | Diglyceride acyltransferase
Type:
Protein
Mol. Mass.:
55297.82
Organism:
Homo sapiens (Human)
Description:
O75907
Residue:
488
  
Inhibitor
Name:
BDBM27947
Synonyms:
2-[4-(4-{4-amino-7,7-dimethyl-7H-pyrimido[4,5-b][1,4]oxazin-6-yl}phenyl)cyclohexyl]acetic acid | pyrimido[4,5-b][1,4]oxazine derivative, 2
Type:
Small organic molecule
Emp. Form.:
C22H26N4O3
Mol. Mass.:
394.4668
SMILES:
CC1(C)Oc2ncnc(N)c2N=C1c1ccc(cc1)[C@H]1CC[C@H](CC(O)=O)CC1
: