Target
RAC-alpha serine/threonine-protein kinase
Ligand
BDBM50343190
Substrate
Meas. Tech.
ChEMBL_745561 (CHEMBL1775878)
IC50
4010±n/a nM
Citation
 D'Angelo, NDKim, TSAndrews, KBooker, SKCaenepeel, SChen, KD'Amico, DFreeman, DJiang, JLiu, LMcCarter, JDSan Miguel, TMullady, ELSchrag, MSubramanian, RTang, JWahl, RCWang, LWhittington, DAWu, TXi, NXu, YYakowec, PYang, KZalameda, LPZhang, NHughes, PNorman, MH Discovery and optimization of a series of benzothiazole phosphoinositide 3-kinase (PI3K)/mammalian target of rapamycin (mTOR) dual inhibitors. J Med Chem 54:1789-811 (2011)  
Target
Name:
RAC-alpha serine/threonine-protein kinase
Synonyms:
AKT phosphorylation (p-AKT) AKT1/PPP1CA C-AKT PKB alpha Protein kinase B Protein kinase B (Akt 1) Protein kinase B alpha Proto-oncogene Akt (Akt1) Proto-oncogene c-Akt (AKT1) RAC-PK-alpha RAC-alpha serine/threonine-protein kinase (AKT1) | RAC-alpha serine/threonine-protein kinase (pAKT)
Type:
Enzyme
Mol. Mass.:
55681.25
Organism:
Homo sapiens (Human)
Description:
P31749
Residue:
480
  
Inhibitor
Name:
BDBM50343190
Synonyms:
CHEMBL1773577 | N-(6-(2-(2-Fluorophenylsulfonamido)pyrimidin-4-yl)benzo-[d]thiazol-2-yl)acetamide
Type:
Small organic molecule
Emp. Form.:
C19H14FN5O3S2
Mol. Mass.:
443.475
SMILES:
CC(=O)Nc1nc2ccc(cc2s1)-c1ccnc(NS(=O)(=O)c2ccccc2F)n1
: