Target
High affinity cAMP-specific and IBMX-insensitive 3',5'-cyclic phosphodiesterase 8B
Ligand
BDBM50344037
Substrate
Meas. Tech.
ChEMBL_748479 (CHEMBL1780332)
IC50
40±n/a nM
Citation
 DeNinno, MPWright, SWVisser, MSEtienne, JBMoore, DEOlson, TVRocke, BNAndrews, MPZarbo, CMillham, MLBoscoe, BPBoyer, DDDoran, SDHouseknecht, KL 1,5-Substituted nipecotic amides: selective PDE8 inhibitors displaying diastereomer-dependent microsomal stability. Bioorg Med Chem Lett 21:3095-8 (2011)  
Target
Name:
High affinity cAMP-specific and IBMX-insensitive 3',5'-cyclic phosphodiesterase 8B
Synonyms:
PDE8B Phosphodiesterase 8 | Phosphodiesterase 8B
Type:
PROTEIN
Mol. Mass.:
98984.88
Organism:
Homo sapiens (Human)
Description:
ChEMBL_876321
Residue:
885
  
Inhibitor
Name:
BDBM50344037
Synonyms:
CHEMBL1779983 | trans-(3R,5R)-5-methyl-1-((5-methyl-2-phenyloxazol-4-yl)methyl)-N-((6-methylpyridin-2-yl)methyl)piperidine-3-carboxamide
Type:
Small organic molecule
Emp. Form.:
C25H30N4O2
Mol. Mass.:
418.5313
SMILES:
C[C@@H]1C[C@H](CN(Cc2nc(oc2C)-c2ccccc2)C1)C(=O)NCc1cccc(C)n1
: