Target
Prostaglandin D2 receptor 2
Ligand
BDBM50344991
Substrate
Meas. Tech.
ChEMBL_749145 (CHEMBL1780742)
IC50
1±n/a nM
Citation
 Luker, TBonnert, RSchmidt, JSargent, CPaine, SWThom, SPairaudeau, GPatel, AMohammed, RAkam, EDougall, IDavis, AMAbbott, PBrough, SMillichip, IMcInally, T Switching between agonists and antagonists at CRTh2 in a series of highly potent and selective biaryl phenoxyacetic acids. Bioorg Med Chem Lett 21:3616-21 (2011)  
Target
Name:
Prostaglandin D2 receptor 2
Synonyms:
CD294 antigen G protein-coupled receptor 44 PD2R2_MOUSE | Ptgdr2
Type:
G Protein-Coupled Receptor (GPCR)
Mol. Mass.:
42975.89
Organism:
Mus musculus (mouse)
Description:
Human embryonic kidney (HEK) 293(EBNA) cells were transfected with mouse CRTH2.
Residue:
382
  
Inhibitor
Name:
BDBM50344991
Synonyms:
2-(4'-(ethylsulfonyl)-2'-methyl-5-(trifluoromethyl)biphenyl-2-yloxy)acetic acid | CHEMBL1778639
Type:
Small organic molecule
Emp. Form.:
C18H17F3O5S
Mol. Mass.:
402.385
SMILES:
CCS(=O)(=O)c1ccc(c(C)c1)-c1cc(ccc1OCC(O)=O)C(F)(F)F
: