Target
Peroxisome proliferator-activated receptor gamma
Ligand
BDBM50347564
Substrate
Meas. Tech.
ChEMBL_757049 (CHEMBL1803890)
EC50
89±n/a nM
Citation
 Casimiro-Garcia, AFilzen, GFFlynn, DBigge, CFChen, JDavis, JADudley, DAEdmunds, JJEsmaeil, NGeyer, AHeemstra, RJJalaie, MOhren, JFOstroski, REllis, TSchaum, RPStoner, C Discovery of a series of imidazo[4,5-b]pyridines with dual activity at angiotensin II type 1 receptor and peroxisome proliferator-activated receptor-¿. J Med Chem 54:4219-33 (2011)  
Target
Name:
Peroxisome proliferator-activated receptor gamma
Synonyms:
NR1C3 PPAR-gamma PPARG_HUMAN Peroxisome proliferator-activated receptor gamma (PPAR gamma) Peroxisome proliferator-activated receptor gamma (PPARĪ³) peroxisome proliferator-activated receptor gamma isoform 2
Type:
Nuclear Receptor
Mol. Mass.:
57613.46
Organism:
Homo sapiens (Human)
Description:
P37231
Residue:
505
  
Inhibitor
Name:
BDBM50347564
Synonyms:
CHEMBL1801741
Type:
Small organic molecule
Emp. Form.:
C30H33N7
Mol. Mass.:
491.6299
SMILES:
CC(C)Cc1cc(C)c2nc(C(C)C)n([C@H]3CCc4cc(ccc34)-c3ccccc3-c3nnn[nH]3)c2n1
: