Target
Peroxisome proliferator-activated receptor gamma
Ligand
BDBM50282478
Substrate
Meas. Tech.
ChEMBL_757049 (CHEMBL1803890)
EC50
2200±n/a nM
Citation
 Casimiro-Garcia, AFilzen, GFFlynn, DBigge, CFChen, JDavis, JADudley, DAEdmunds, JJEsmaeil, NGeyer, AHeemstra, RJJalaie, MOhren, JFOstroski, REllis, TSchaum, RPStoner, C Discovery of a series of imidazo[4,5-b]pyridines with dual activity at angiotensin II type 1 receptor and peroxisome proliferator-activated receptor-¿. J Med Chem 54:4219-33 (2011)  
Target
Name:
Peroxisome proliferator-activated receptor gamma
Synonyms:
NR1C3 PPAR-gamma PPARG_HUMAN Peroxisome proliferator-activated receptor gamma (PPAR gamma) Peroxisome proliferator-activated receptor gamma (PPARĪ³) peroxisome proliferator-activated receptor gamma isoform 2
Type:
Nuclear Receptor
Mol. Mass.:
57613.46
Organism:
Homo sapiens (Human)
Description:
P37231
Residue:
505
  
Inhibitor
Name:
BDBM50282478
Synonyms:
2-Butyl-5,7-dimethyl-3-{5-[2-(1H-tetrazol-5-yl)-phenyl]-indan-1-yl}-3H-imidazo[4,5-b]pyridine | CHEMBL414836
Type:
Small organic molecule
Emp. Form.:
C28H29N7
Mol. Mass.:
463.5768
SMILES:
CCCCc1nc2c(C)cc(C)nc2n1C1CCc2cc(ccc12)-c1ccccc1-c1nnn[nH]1
: