Target
Corticotropin-releasing factor receptor 1
Ligand
BDBM50272695
Substrate
Meas. Tech.
ChEMBL_759193 (CHEMBL1811339)
Ki
0.2±n/a nM
Citation
 Hodgetts, KJGe, PYoon, TDe Lombaert, SBrodbeck, RGulianello, MKieltyka, AHorvath, RFKehne, JHKrause, JEMaynard, GDHoffman, DLee, YFung, LDoller, D Discovery of N-(1-ethylpropyl)-[3-methoxy-5-(2-methoxy-4-trifluoromethoxyphenyl)-6-methyl-pyrazin-2-yl]amine 59 (NGD 98-2): an orally active corticotropin releasing factor-1 (CRF-1) receptor antagonist. J Med Chem 54:4187-206 (2011)  
Target
Name:
Corticotropin-releasing factor receptor 1
Synonyms:
CRF-R CRF1 CRFR1 CRH-R 1 CRHR1 Corticotropin-releasing factor receptor 1 (CRF-1) Corticotropin-releasing hormone receptor 1
Type:
Enzyme
Mol. Mass.:
50744.31
Organism:
Homo sapiens (Human)
Description:
P34998
Residue:
444
  
Inhibitor
Name:
BDBM50272695
Synonyms:
3-(4-chloro-2-morpholinothiazol-5-yl)-2,6-dimethyl-8-(pentan-3-yl)imidazo[1,2-b]pyridazine | CHEMBL498311
Type:
Small organic molecule
Emp. Form.:
C20H26ClN5OS
Mol. Mass.:
419.971
SMILES:
CCC(CC)c1cc(C)nn2c(c(C)nc12)-c1sc(nc1Cl)N1CCOCC1
: