Target
Cathepsin S
Ligand
BDBM50349198
Substrate
Meas. Tech.
ChEMBL_759683 (CHEMBL1811516)
IC50
2.9±n/a nM
Citation
 Kerns, JKNie, HBondinell, WWiddowson, KLYamashita, DSRahman, APodolin, PLCarpenter, DCJin, QRiflade, BDong, XNevins, NKeller, PMMitchell, LTomaszek, T Azepanone-based inhibitors of human cathepsin S: optimization of selectivity via the P2 substituent. Bioorg Med Chem Lett 21:4409-15 (2011)  
Target
Name:
Cathepsin S
Synonyms:
CATS_HUMAN Cathepsin S (Cat S) | cathepsin S preproprotein
Type:
Protein
Mol. Mass.:
37507.38
Organism:
Homo sapiens (Human)
Description:
P25774
Residue:
331
  
Inhibitor
Name:
BDBM50349198
Synonyms:
CHEMBL1807649
Type:
Small organic molecule
Emp. Form.:
C23H30N4O6S
Mol. Mass.:
490.573
SMILES:
CC(C)C[C@H](NC(=O)c1ccco1)C(=O)N[C@H]1CC[C@@H](C)N(CC1=O)S(=O)(=O)c1ccccn1
: