Target
Cathepsin S
Ligand
BDBM50349206
Substrate
Meas. Tech.
ChEMBL_759683 (CHEMBL1811516)
IC50
1.5±n/a nM
Citation
 Kerns, JKNie, HBondinell, WWiddowson, KLYamashita, DSRahman, APodolin, PLCarpenter, DCJin, QRiflade, BDong, XNevins, NKeller, PMMitchell, LTomaszek, T Azepanone-based inhibitors of human cathepsin S: optimization of selectivity via the P2 substituent. Bioorg Med Chem Lett 21:4409-15 (2011)  
Target
Name:
Cathepsin S
Synonyms:
CATS_HUMAN Cathepsin S (Cat S) | cathepsin S preproprotein
Type:
Protein
Mol. Mass.:
37507.38
Organism:
Homo sapiens (Human)
Description:
P25774
Residue:
331
  
Inhibitor
Name:
BDBM50349206
Synonyms:
CHEMBL1807702
Type:
Small organic molecule
Emp. Form.:
C29H43N5O6S
Mol. Mass.:
589.747
SMILES:
C[C@@H]1CC[C@H](NC(=O)[C@H](CC23CCC(CC2)C3(C)C)NC(=O)N2CCOCC2)C(=O)CN1S(=O)(=O)c1ccccn1
: