Target
Cathepsin K
Ligand
BDBM50349198
Substrate
Meas. Tech.
ChEMBL_759684 (CHEMBL1811517)
IC50
1±n/a nM
Citation
 Kerns, JKNie, HBondinell, WWiddowson, KLYamashita, DSRahman, APodolin, PLCarpenter, DCJin, QRiflade, BDong, XNevins, NKeller, PMMitchell, LTomaszek, T Azepanone-based inhibitors of human cathepsin S: optimization of selectivity via the P2 substituent. Bioorg Med Chem Lett 21:4409-15 (2011)  
Target
Name:
Cathepsin K
Synonyms:
CATK_HUMAN CTSO Cathepsin O Cathepsin X
Type:
Enzyme
Mol. Mass.:
36975.68
Organism:
Homo sapiens (Human)
Description:
P43235
Residue:
329
  
Inhibitor
Name:
BDBM50349198
Synonyms:
CHEMBL1807649
Type:
Small organic molecule
Emp. Form.:
C23H30N4O6S
Mol. Mass.:
490.573
SMILES:
CC(C)C[C@H](NC(=O)c1ccco1)C(=O)N[C@H]1CC[C@@H](C)N(CC1=O)S(=O)(=O)c1ccccn1
: