Target
Procathepsin L
Ligand
BDBM50349196
Substrate
Meas. Tech.
ChEMBL_759685 (CHEMBL1811518)
IC50
4.8±n/a nM
Citation
 Kerns, JKNie, HBondinell, WWiddowson, KLYamashita, DSRahman, APodolin, PLCarpenter, DCJin, QRiflade, BDong, XNevins, NKeller, PMMitchell, LTomaszek, T Azepanone-based inhibitors of human cathepsin S: optimization of selectivity via the P2 substituent. Bioorg Med Chem Lett 21:4409-15 (2011)  
Target
Name:
Procathepsin L
Synonyms:
CATL1_HUMAN CTSL CTSL1 Cathepsin L Cathepsin L1 heavy chain MEP cathepsin L preproprotein
Type:
Enzyme
Mol. Mass.:
37557.19
Organism:
Homo sapiens (Human)
Description:
Purchased from Calbiochem (San Diego, CA).
Residue:
333
  
Inhibitor
Name:
BDBM50349196
Synonyms:
CHEMBL1807646
Type:
Small organic molecule
Emp. Form.:
C25H32N4O6S
Mol. Mass.:
516.61
SMILES:
C[C@@H]1CC[C@H](NC(=O)[C@H](CC2CCCC2)NC(=O)c2ccco2)C(=O)CN1S(=O)(=O)c1ccccn1
: