Target
Cannabinoid receptor 2
Ligand
BDBM50349311
Substrate
Meas. Tech.
ChEMBL_759949 (CHEMBL1810143)
EC50
17.9±n/a nM
Citation
 Evens, NVandeputte, CMuccioli, GGLambert, DMBaekelandt, VVerbruggen, AMDebyser, ZVan Laere, KBormans, GM Synthesis, in vitro and in vivo evaluation of fluorine-18 labelled FE-GW405833 as a PET tracer for type 2 cannabinoid receptor imaging. Bioorg Med Chem 19:4499-505 (2011)  
Target
Name:
Cannabinoid receptor 2
Synonyms:
CANNABINOID CB2 CB2 CB2B CNR2_HUMAN Cannabinoid CB2 receptor Cannabinoid receptor 2 (CB2R) | hCB2
Type:
G Protein-Coupled Receptor (GPCR)
Mol. Mass.:
39690.94
Organism:
Homo sapiens (Human)
Description:
P34972
Residue:
360
  
Inhibitor
Name:
BDBM50349311
Synonyms:
CHEMBL1807841
Type:
Small organic molecule
Emp. Form.:
C24H25Cl2FN2O3
Mol. Mass.:
479.371
SMILES:
Cc1c(CCN2CCOCC2)c2cc(OCCF)ccc2n1C(=O)c1cccc(Cl)c1Cl
: