Target
Melanin-concentrating hormone receptor 1
Ligand
BDBM50351315
Substrate
Meas. Tech.
ChEMBL_764331 (CHEMBL1821542)
IC50
5.5±n/a nM
Citation
 Kamata, MYamashita, TImaeda, TTanaka, TTerauchi, JMiyamoto, MOra, TTawada, MEndo, STakekawa, SAsami, ASuzuki, NNagisa, YNakano, YWatanabe, KOgino, HKato, KKato, KIshihara, Y Discovery, synthesis, and structure-activity relationship of 6-aminomethyl-7,8-dihydronaphthalenes as human melanin-concentrating hormone receptor 1 antagonists. Bioorg Med Chem 19:5539-52 (2011)  
Target
Name:
Melanin-concentrating hormone receptor 1
Synonyms:
G-protein coupled receptor 24 MCH receptor 1 MCH-R1 MCHR-1 MCHR1_HUMAN Melanin-Concentrating Hormone Receptor 1 (MCH1R) Melanin-concentrating hormone receptor 1 (MCH-1) Melanin-concentrating hormone receptor 1 (MCHR-1) SLC-1 Somatostatin receptor-like protein
Type:
G Protein-Coupled Receptor (GPCR)
Mol. Mass.:
45976.27
Organism:
Homo sapiens (Human)
Description:
Membranes from CHO-K1 cells stably expressing human MCH1R were used in assays.
Residue:
422
  
Inhibitor
Name:
BDBM50351315
Synonyms:
CHEMBL1818803
Type:
Small organic molecule
Emp. Form.:
C25H23ClN2O
Mol. Mass.:
402.916
SMILES:
CNCC1=Cc2ccc(NC(=O)c3ccc(cc3)-c3ccc(Cl)cc3)cc2CC1
: