Target
Melanin-concentrating hormone receptor 1
Ligand
BDBM50351314
Substrate
Meas. Tech.
ChEMBL_764333 (CHEMBL1821544)
IC50
5.3±n/a nM
Citation
 Kamata, MYamashita, TImaeda, TTanaka, TTerauchi, JMiyamoto, MOra, TTawada, MEndo, STakekawa, SAsami, ASuzuki, NNagisa, YNakano, YWatanabe, KOgino, HKato, KKato, KIshihara, Y Discovery, synthesis, and structure-activity relationship of 6-aminomethyl-7,8-dihydronaphthalenes as human melanin-concentrating hormone receptor 1 antagonists. Bioorg Med Chem 19:5539-52 (2011)  
Target
Name:
Melanin-concentrating hormone receptor 1
Synonyms:
G-protein coupled receptor 24 MCH receptor 1 MCH-R1 MCHR MCHR1_RAT Melanin Concentrating Hormone 1 Melanin-concentrating hormone receptor 1 Slc1 | Somatostatin receptor-like protein
Type:
Enzyme Catalytic Domain
Mol. Mass.:
39075.64
Organism:
RAT
Description:
Melanin Concentrating Hormone 1 GPR24 RAT::P97639
Residue:
353
  
Inhibitor
Name:
BDBM50351314
Synonyms:
CHEMBL1818802
Type:
Small organic molecule
Emp. Form.:
C29H30ClN3O
Mol. Mass.:
472.021
SMILES:
CN1CCN(CC2=Cc3ccc(NC(=O)c4ccc(cc4)-c4ccc(Cl)cc4)cc3CC2)CC1
: