Target
Melanin-concentrating hormone receptor 1
Ligand
BDBM50351317
Substrate
Meas. Tech.
ChEMBL_764333 (CHEMBL1821544)
IC50
13±n/a nM
Citation
 Kamata, MYamashita, TImaeda, TTanaka, TTerauchi, JMiyamoto, MOra, TTawada, MEndo, STakekawa, SAsami, ASuzuki, NNagisa, YNakano, YWatanabe, KOgino, HKato, KKato, KIshihara, Y Discovery, synthesis, and structure-activity relationship of 6-aminomethyl-7,8-dihydronaphthalenes as human melanin-concentrating hormone receptor 1 antagonists. Bioorg Med Chem 19:5539-52 (2011)  
Target
Name:
Melanin-concentrating hormone receptor 1
Synonyms:
G-protein coupled receptor 24 MCH receptor 1 MCH-R1 MCHR MCHR1_RAT Melanin Concentrating Hormone 1 Melanin-concentrating hormone receptor 1 Slc1 | Somatostatin receptor-like protein
Type:
Enzyme Catalytic Domain
Mol. Mass.:
39075.64
Organism:
RAT
Description:
Melanin Concentrating Hormone 1 GPR24 RAT::P97639
Residue:
353
  
Inhibitor
Name:
BDBM50351317
Synonyms:
CHEMBL1818805
Type:
Small organic molecule
Emp. Form.:
C27H25ClN2O2
Mol. Mass.:
444.953
SMILES:
CN(CC1=Cc2ccc(NC(=O)c3ccc(cc3)-c3ccc(Cl)cc3)cc2CC1)C(C)=O
: