Target
Melanin-concentrating hormone receptor 1
Ligand
BDBM50351321
Substrate
Meas. Tech.
ChEMBL_764333 (CHEMBL1821544)
IC50
12±n/a nM
Citation
 Kamata, MYamashita, TImaeda, TTanaka, TTerauchi, JMiyamoto, MOra, TTawada, MEndo, STakekawa, SAsami, ASuzuki, NNagisa, YNakano, YWatanabe, KOgino, HKato, KKato, KIshihara, Y Discovery, synthesis, and structure-activity relationship of 6-aminomethyl-7,8-dihydronaphthalenes as human melanin-concentrating hormone receptor 1 antagonists. Bioorg Med Chem 19:5539-52 (2011)  
Target
Name:
Melanin-concentrating hormone receptor 1
Synonyms:
G-protein coupled receptor 24 MCH receptor 1 MCH-R1 MCHR MCHR1_RAT Melanin Concentrating Hormone 1 Melanin-concentrating hormone receptor 1 Slc1 | Somatostatin receptor-like protein
Type:
Enzyme Catalytic Domain
Mol. Mass.:
39075.64
Organism:
RAT
Description:
Melanin Concentrating Hormone 1 GPR24 RAT::P97639
Residue:
353
  
Inhibitor
Name:
BDBM50351321
Synonyms:
CHEMBL1818809
Type:
Small organic molecule
Emp. Form.:
C28H28N2O
Mol. Mass.:
408.5347
SMILES:
O=C(Nc1ccc2C=C(CN3CCCC3)CCc2c1)c1ccc(cc1)-c1ccccc1
: