Target
Vesicular acetylcholine transporter
Ligand
BDBM50351985
Substrate
Meas. Tech.
ChEMBL_765941 (CHEMBL1827957)
Ki
36±n/a nM
Citation
 Wang, WCui, JLu, XPadakanti, PKXu, JParsons, SMLuedtke, RRRath, NPTu, Z Synthesis and in vitro biological evaluation of carbonyl group-containing analogues fors1 receptors. J Med Chem 54:5362-72 (2011)  
Target
Name:
Vesicular acetylcholine transporter
Synonyms:
SLC18A3 VACHT | VACHT_HUMAN
Type:
PROTEIN
Mol. Mass.:
56900.67
Organism:
Homo sapiens (Human)
Description:
ChEMBL_1507628
Residue:
532
  
Inhibitor
Name:
BDBM50351985
Synonyms:
CHEMBL1822407
Type:
Small organic molecule
Emp. Form.:
C25H32N2O3
Mol. Mass.:
408.5332
SMILES:
COc1ccc(cc1)C(=O)C1CCN(CC1)[C@H]1CN(Cc2ccccc2)CC[C@@H]1O
: