Target
Vesicular acetylcholine transporter
Ligand
BDBM50351967
Substrate
Meas. Tech.
ChEMBL_765941 (CHEMBL1827957)
Ki
2030±n/a nM
Citation
 Wang, WCui, JLu, XPadakanti, PKXu, JParsons, SMLuedtke, RRRath, NPTu, Z Synthesis and in vitro biological evaluation of carbonyl group-containing analogues fors1 receptors. J Med Chem 54:5362-72 (2011)  
Target
Name:
Vesicular acetylcholine transporter
Synonyms:
SLC18A3 VACHT | VACHT_HUMAN
Type:
PROTEIN
Mol. Mass.:
56900.67
Organism:
Homo sapiens (Human)
Description:
ChEMBL_1507628
Residue:
532
  
Inhibitor
Name:
BDBM50351967
Synonyms:
CHEMBL1822389
Type:
Small organic molecule
Emp. Form.:
C23H28FN3O2
Mol. Mass.:
397.4857
SMILES:
O[C@H]1CN(Cc2cccnc2)CC[C@@H]1N1CCC(CC1)C(=O)c1ccc(F)cc1
: